Target
Sodium-dependent serotonin transporter
Ligand
BDBM50048110
Substrate
Meas. Tech.
ChEMBL_273 (CHEMBL615713)
IC50
3600000±n/a nM
Citation
 Patel, PJMesser, WSHudson, RA Inhibition and inactivation of presynaptic cholinergic markers using redox-reactive choline analogs. J Med Chem 36:1893-901 (1993)  
Target
Name:
Sodium-dependent serotonin transporter
Synonyms:
5-HT Transporter 5HT transporter Anandamid membrane transporter, AMT Monoamine transporters; Norepinephrine & serotonin Slc6a4 Sodium-dependent serotonin transporter (SERT) | imipramine receptor
Type:
Multi-pass membrane protein
Mol. Mass.:
70168.43
Organism:
Rattus norvegicus (rat)
Description:
P31652
Residue:
630
  
Inhibitor
Name:
BDBM50048110
Synonyms:
CHEMBL57055 | [2-(3,4-Dihydroxy-phenyl)-2-hydroxy-ethyl]-trimethyl-ammonium; iodide
Type:
Small organic molecule
Emp. Form.:
C11H18NO3
Mol. Mass.:
212.265
SMILES:
C[N+](C)(C)CC(O)c1ccc(O)c(O)c1
: