Target
Carbonic anhydrase 2
Ligand
BDBM10882
Substrate
Meas. Tech.
ChEMBL_1538231 (CHEMBL3737170)
Ki
8.0±n/a nM
Citation
 Cincinelli, AMartellini, TVullo, DSupuran, CT Anion and sulfonamide inhibition studies of an ?-carbonic anhydrase from the Antarctic hemoglobinless fish Chionodraco hamatus. Bioorg Med Chem Lett 25:5485-9 (2015)  
Target
Name:
Carbonic anhydrase 2
Synonyms:
CA-II CAC Carbonate dehydratase II Carbonic anhydrase 2 (CA-II) Carbonic anhydrase C Carbonic anhydrase II (CA-II) Carbonic anhydrase II (hCA II) | Carbonic anhydrase isoenzyme II (hCA II)
Type:
Enzyme
Mol. Mass.:
29250.71
Organism:
Homo sapiens (Human)
Description:
P00918
Residue:
260
  
Inhibitor
Name:
BDBM10882
Synonyms:
6-ethoxy-1,3-benzothiazole-2-sulfonamide Ethamide Ethoxzolamide Ethoxzolamide, EZM US10172837, Ethoxyzolamide | sulfonamide 3
Type:
Small organic molecule
Emp. Form.:
C9H10N2O3S2
Mol. Mass.:
258.317
SMILES:
CCOc1ccc2nc(sc2c1)S(N)(=O)=O
: