Target
Carbonic anhydrase 1
Ligand
BDBM50152968
Substrate
Meas. Tech.
ChEMBL_1538230 (CHEMBL3737169)
Ki
500±n/a nM
Citation
 Cincinelli, AMartellini, TVullo, DSupuran, CT Anion and sulfonamide inhibition studies of an ?-carbonic anhydrase from the Antarctic hemoglobinless fish Chionodraco hamatus. Bioorg Med Chem Lett 25:5485-9 (2015)  
Target
Name:
Carbonic anhydrase 1
Synonyms:
CA-I CAB Carbonate dehydratase I Carbonic anhydrase 1 (CA I) Carbonic anhydrase 1 (Recombinant CA I) Carbonic anhydrase B Carbonic anhydrase I (CA I) Carbonic anhydrase I (CAI) Carbonic anhydrase isoenzyme I (hCA I) | hCA
Type:
Enzyme
Mol. Mass.:
28873.37
Organism:
Homo sapiens (Human)
Description:
P00915
Residue:
261
  
Inhibitor
Name:
BDBM50152968
Synonyms:
Blausaeure Cyanwasserstoff formonitrile hydrocyanic acid | hydrogen cyanide
Type:
Small organic molecule
Emp. Form.:
CHN
Mol. Mass.:
27.0253
SMILES:
C#N
: