Target
Zinc metalloproteinase dpy-31
Ligand
BDBM50499818
Substrate
Meas. Tech.
ChEMBL_1541441 (CHEMBL3743609)
IC50
25119±n/a nM
Citation
 France, DJStepek, GHouston, DRWilliams, LMcCormack, GWalkinshaw, MDPage, AP Identification and activity of inhibitors of the essential nematode-specific metalloprotease DPY-31. Bioorg Med Chem Lett 25:5752-5 (2015)  
Target
Name:
Zinc metalloproteinase dpy-31
Synonyms:
3.4.24.- Nematode astacin 35 Zinc metalloproteinase dpy-31 nas-35
Type:
PROTEIN
Mol. Mass.:
69706.72
Organism:
Teladorsagia circumcincta
Description:
ChEMBL_116693
Residue:
614
  
Inhibitor
Name:
BDBM50499818
Synonyms:
CHEMBL3740110
Type:
Small organic molecule
Emp. Form.:
C22H32N4O6
Mol. Mass.:
448.5127
SMILES:
C[C@H](NC(=O)[C@@H]1CCCN1C(=O)OC(C)(C)C)C(=O)N[C@@H](Cc1ccccc1)C(=O)NO
: