Target
Zinc metalloproteinase dpy-31
Ligand
BDBM50499820
Substrate
Meas. Tech.
ChEMBL_1541441 (CHEMBL3743609)
IC50
31623±n/a nM
Citation
 France, DJStepek, GHouston, DRWilliams, LMcCormack, GWalkinshaw, MDPage, AP Identification and activity of inhibitors of the essential nematode-specific metalloprotease DPY-31. Bioorg Med Chem Lett 25:5752-5 (2015)  
Target
Name:
Zinc metalloproteinase dpy-31
Synonyms:
3.4.24.- Nematode astacin 35 Zinc metalloproteinase dpy-31 nas-35
Type:
PROTEIN
Mol. Mass.:
69706.72
Organism:
Teladorsagia circumcincta
Description:
ChEMBL_116693
Residue:
614
  
Inhibitor
Name:
BDBM50499820
Synonyms:
CHEMBL3740431
Type:
Small organic molecule
Emp. Form.:
C32H34N4O6
Mol. Mass.:
570.6356
SMILES:
C[C@H](NC(=O)[C@@H]1CCCN1C(=O)OCC1c2ccccc2-c2ccccc12)C(=O)N[C@@H](Cc1ccccc1)C(=O)NO
: