Target
Zinc metalloproteinase dpy-31
Ligand
BDBM50499819
Substrate
Meas. Tech.
ChEMBL_1541441 (CHEMBL3743609)
IC50
>500000±n/a nM
Citation
 France, DJStepek, GHouston, DRWilliams, LMcCormack, GWalkinshaw, MDPage, AP Identification and activity of inhibitors of the essential nematode-specific metalloprotease DPY-31. Bioorg Med Chem Lett 25:5752-5 (2015)  
Target
Name:
Zinc metalloproteinase dpy-31
Synonyms:
3.4.24.- Nematode astacin 35 Zinc metalloproteinase dpy-31 nas-35
Type:
PROTEIN
Mol. Mass.:
69706.72
Organism:
Teladorsagia circumcincta
Description:
ChEMBL_116693
Residue:
614
  
Inhibitor
Name:
BDBM50499819
Synonyms:
CHEMBL3740244
Type:
Small organic molecule
Emp. Form.:
C37H52N5O9P
Mol. Mass.:
741.8106
SMILES:
COC(=O)[C@@H]1CCCN1C(=O)[C@H](C)CP(O)(=O)[C@H](Cc1ccccc1)NC(=O)[C@H](CCCCN)NC(=O)[C@@H]1CCCN1C(=O)OCc1ccccc1
: