Target
Thymidylate synthase
Ligand
BDBM50049263
Substrate
Meas. Tech.
ChEMBL_209813 (CHEMBL815678)
IC50
200±n/a nM
Citation
 Hennequin, LFBoyle, FTWardleworth, JMMarsham, PRKimbell, RJackman, AL Quinazoline antifolates thymidylate synthase inhibitors: lipophilic analogues with modification to the C2-methyl substituent. J Med Chem 39:695-704 (1996)  
Target
Name:
Thymidylate synthase
Synonyms:
TS TYSY_MOUSE | Tyms
Type:
PROTEIN
Mol. Mass.:
34957.15
Organism:
Mus musculus
Description:
ChEMBL_1340097
Residue:
307
  
Inhibitor
Name:
BDBM50049263
Synonyms:
4-[(2-{[(2-Dimethylamino-ethyl)-methyl-amino]-methyl}-7-methyl-4-oxo-3,4-dihydro-quinazolin-6-ylmethyl)-prop-2-ynyl-amino]-2-fluoro-N-(3-nitro-benzyl)-benzamide | CHEMBL159655
Type:
Small organic molecule
Emp. Form.:
C33H36FN7O4
Mol. Mass.:
613.6818
SMILES:
CN(C)CCN(C)Cc1nc2cc(C)c(CN(CC#C)c3ccc(C(=O)NCc4cccc(c4)[N+]([O-])=O)c(F)c3)cc2c(=O)[nH]1
: