Target
Thymidylate synthase
Ligand
BDBM50049276
Substrate
Meas. Tech.
ChEMBL_209813 (CHEMBL815678)
IC50
28±n/a nM
Citation
 Hennequin, LFBoyle, FTWardleworth, JMMarsham, PRKimbell, RJackman, AL Quinazoline antifolates thymidylate synthase inhibitors: lipophilic analogues with modification to the C2-methyl substituent. J Med Chem 39:695-704 (1996)  
Target
Name:
Thymidylate synthase
Synonyms:
TS TYSY_MOUSE | Tyms
Type:
PROTEIN
Mol. Mass.:
34957.15
Organism:
Mus musculus
Description:
ChEMBL_1340097
Residue:
307
  
Inhibitor
Name:
BDBM50049276
Synonyms:
2-(2-Fluoro-4-{methyl-[7-methyl-2-(4-methyl-piperazin-1-ylmethyl)-4-oxo-3,4-dihydro-quinazolin-6-ylmethyl]-amino}-benzoylamino)-pentanedioic acid | CHEMBL161641
Type:
Small organic molecule
Emp. Form.:
C29H35FN6O6
Mol. Mass.:
582.6232
SMILES:
CN(Cc1cc2c(cc1C)nc(CN1CCN(C)CC1)[nH]c2=O)c1ccc(C(=O)NC(CCC(O)=O)C(O)=O)c(F)c1
: