Target
Thymidylate synthase
Ligand
BDBM50049278
Substrate
Meas. Tech.
ChEMBL_209813 (CHEMBL815678)
IC50
3300±n/a nM
Citation
 Hennequin, LFBoyle, FTWardleworth, JMMarsham, PRKimbell, RJackman, AL Quinazoline antifolates thymidylate synthase inhibitors: lipophilic analogues with modification to the C2-methyl substituent. J Med Chem 39:695-704 (1996)  
Target
Name:
Thymidylate synthase
Synonyms:
TS TYSY_MOUSE | Tyms
Type:
PROTEIN
Mol. Mass.:
34957.15
Organism:
Mus musculus
Description:
ChEMBL_1340097
Residue:
307
  
Inhibitor
Name:
BDBM50049278
Synonyms:
4-{[2-(4-Hydroxy-pyrimidin-2-ylsulfanylmethyl)-4-oxo-3,4-dihydro-quinazolin-6-ylmethyl]-prop-2-ynyl-amino}-N-(3-nitro-benzyl)-benzamide | CHEMBL161349
Type:
Small organic molecule
Emp. Form.:
C31H25N7O5S
Mol. Mass.:
607.639
SMILES:
[O-][N+](=O)c1cccc(CNC(=O)c2ccc(cc2)N(CC#C)Cc2ccc3nc(CSc4nccc(=[OH+])[n-]4)[nH]c(=O)c3c2)c1
: