Target
Thymidylate synthase
Ligand
BDBM50049281
Substrate
Meas. Tech.
ChEMBL_209813 (CHEMBL815678)
IC50
84.0±n/a nM
Citation
 Hennequin, LFBoyle, FTWardleworth, JMMarsham, PRKimbell, RJackman, AL Quinazoline antifolates thymidylate synthase inhibitors: lipophilic analogues with modification to the C2-methyl substituent. J Med Chem 39:695-704 (1996)  
Target
Name:
Thymidylate synthase
Synonyms:
TS TYSY_MOUSE | Tyms
Type:
PROTEIN
Mol. Mass.:
34957.15
Organism:
Mus musculus
Description:
ChEMBL_1340097
Residue:
307
  
Inhibitor
Name:
BDBM50049281
Synonyms:
4-[(2-Dimethylaminomethyl-7-methyl-4-oxo-3,4-dihydro-quinazolin-6-ylmethyl)-methyl-amino]-2-fluoro-N-(3-nitro-benzyl)-benzamide | CHEMBL162349
Type:
Small organic molecule
Emp. Form.:
C28H29FN6O4
Mol. Mass.:
532.5661
SMILES:
CN(C)Cc1nc2cc(C)c(CN(C)c3ccc(C(=O)NCc4cccc(c4)[N+]([O-])=O)c(F)c3)cc2c(=O)[nH]1
: