Target
Thymidylate synthase
Ligand
BDBM50049261
Substrate
Meas. Tech.
ChEMBL_209813 (CHEMBL815678)
IC50
100±n/a nM
Citation
 Hennequin, LFBoyle, FTWardleworth, JMMarsham, PRKimbell, RJackman, AL Quinazoline antifolates thymidylate synthase inhibitors: lipophilic analogues with modification to the C2-methyl substituent. J Med Chem 39:695-704 (1996)  
Target
Name:
Thymidylate synthase
Synonyms:
TS TYSY_MOUSE | Tyms
Type:
PROTEIN
Mol. Mass.:
34957.15
Organism:
Mus musculus
Description:
ChEMBL_1340097
Residue:
307
  
Inhibitor
Name:
BDBM50049261
Synonyms:
2-Fluoro-4-[(7-methyl-2-morpholin-4-ylmethyl-4-oxo-3,4-dihydro-quinazolin-6-ylmethyl)-prop-2-ynyl-amino]-N-(3-nitro-benzyl)-benzamide | CHEMBL349448
Type:
Small organic molecule
Emp. Form.:
C32H31FN6O5
Mol. Mass.:
598.6241
SMILES:
Cc1cc2nc(CN3CCOCC3)[nH]c(=O)c2cc1CN(CC#C)c1ccc(C(=O)NCc2cccc(c2)[N+]([O-])=O)c(F)c1
: