Target
Thymidylate synthase
Ligand
BDBM50049280
Substrate
Meas. Tech.
ChEMBL_209813 (CHEMBL815678)
IC50
380±n/a nM
Citation
 Hennequin, LFBoyle, FTWardleworth, JMMarsham, PRKimbell, RJackman, AL Quinazoline antifolates thymidylate synthase inhibitors: lipophilic analogues with modification to the C2-methyl substituent. J Med Chem 39:695-704 (1996)  
Target
Name:
Thymidylate synthase
Synonyms:
TS TYSY_MOUSE | Tyms
Type:
PROTEIN
Mol. Mass.:
34957.15
Organism:
Mus musculus
Description:
ChEMBL_1340097
Residue:
307
  
Inhibitor
Name:
BDBM50049280
Synonyms:
4-[(2-Cyanomethyl-4-oxo-3,4-dihydro-quinazolin-6-ylmethyl)-prop-2-ynyl-amino]-N-(3-nitro-benzyl)-benzamide | CHEMBL435856
Type:
Small organic molecule
Emp. Form.:
C28H22N6O4
Mol. Mass.:
506.5121
SMILES:
[O-][N+](=O)c1cccc(CNC(=O)c2ccc(cc2)N(CC#C)Cc2ccc3nc(CC#N)[nH]c(=O)c3c2)c1
: