Target
Thymidylate synthase
Ligand
BDBM50049277
Substrate
Meas. Tech.
ChEMBL_209813 (CHEMBL815678)
IC50
240±n/a nM
Citation
 Hennequin, LFBoyle, FTWardleworth, JMMarsham, PRKimbell, RJackman, AL Quinazoline antifolates thymidylate synthase inhibitors: lipophilic analogues with modification to the C2-methyl substituent. J Med Chem 39:695-704 (1996)  
Target
Name:
Thymidylate synthase
Synonyms:
TS TYSY_MOUSE | Tyms
Type:
PROTEIN
Mol. Mass.:
34957.15
Organism:
Mus musculus
Description:
ChEMBL_1340097
Residue:
307
  
Inhibitor
Name:
BDBM50049277
Synonyms:
2-(4-{[4-Oxo-2-(pyrimidin-2-ylsulfanylmethyl)-3,4-dihydro-quinazolin-6-ylmethyl]-prop-2-ynyl-amino}-benzoylamino)-pentanedioic acid | CHEMBL161642
Type:
Small organic molecule
Emp. Form.:
C29H26N6O6S
Mol. Mass.:
586.618
SMILES:
OC(=O)CCC(NC(=O)c1ccc(cc1)N(CC#C)Cc1ccc2nc(CSc3ncccn3)[nH]c(=O)c2c1)C(O)=O
: