Target
Adenosine receptor A3
Ligand
BDBM50049400
Substrate
Meas. Tech.
ChEMBL_32014 (CHEMBL649050)
Ki
34100.0±n/a nM
Citation
 Ji, XDMelman, NJacobson, KA Interactions of flavonoids and other phytochemicals with adenosine receptors. J Med Chem 39:781-8 (1996)  
Target
Name:
Adenosine receptor A3
Synonyms:
A3 adenosine receptor (hA3) ADORA3 | Adenosine A3 receptor (A3AR)
Type:
G Protein-Coupled Receptor (GPCR)
Mol. Mass.:
36197.32
Organism:
Homo sapiens (Human)
Description:
P0DMS8
Residue:
318
  
Inhibitor
Name:
BDBM50049400
Synonyms:
(+/-) taxifolin (+/-)-taxifolin (2R,3R)-2-(3,4-dihydroxyphenyl)-3,5,7-trihydroxychroman-4-one 2-(3,4-dihydroxyphenyl)-3,5,7-trihydroxychroman-4-one CHEMBL337309 | NSC-2801
Type:
Small organic molecule
Emp. Form.:
C15H12O7
Mol. Mass.:
304.2516
SMILES:
OC1C(=O)C(Oc2cc(O)cc(O)c12)c1ccc(O)c(O)c1
: