Target
Carbonic anhydrase 7
Ligand
BDBM50500026
Substrate
Meas. Tech.
ChEMBL_1541745 (CHEMBL3745427)
Ki
0.460000±n/a nM
Citation
 El-Azab, ASAbdel-Aziz, AAAyyad, RRCeruso, MSupuran, CT Inhibition of carbonic anhydrase isoforms I, II, IV, VII and XII with carboxylates and sulfonamides incorporating phthalimide/phthalic anhydride scaffolds. Bioorg Med Chem 24:20-5 (2016)  
Target
Name:
Carbonic anhydrase 7
Synonyms:
CA-VII CAH7_HUMAN Carbonic anhydrase Carbonic anhydrase VII (CA VII)
Type:
Enzyme
Mol. Mass.:
29664.11
Organism:
Homo sapiens (Human)
Description:
Human cloned isozyme.
Residue:
264
  
Inhibitor
Name:
BDBM50500026
Synonyms:
CHEMBL3741546
Type:
Small organic molecule
Emp. Form.:
C22H15N3O7S
Mol. Mass.:
465.435
SMILES:
NS(=O)(=O)c1ccc(cc1)N1C(=O)c2ccc(cc2C1=O)C(=O)Nc1ccccc1C(O)=O
: