Target
Carbonic anhydrase 7
Ligand
BDBM50500023
Substrate
Meas. Tech.
ChEMBL_1541745 (CHEMBL3745427)
Ki
0.310000±n/a nM
Citation
 El-Azab, ASAbdel-Aziz, AAAyyad, RRCeruso, MSupuran, CT Inhibition of carbonic anhydrase isoforms I, II, IV, VII and XII with carboxylates and sulfonamides incorporating phthalimide/phthalic anhydride scaffolds. Bioorg Med Chem 24:20-5 (2016)  
Target
Name:
Carbonic anhydrase 7
Synonyms:
CA-VII CAH7_HUMAN Carbonic anhydrase Carbonic anhydrase VII (CA VII)
Type:
Enzyme
Mol. Mass.:
29664.11
Organism:
Homo sapiens (Human)
Description:
Human cloned isozyme.
Residue:
264
  
Inhibitor
Name:
BDBM50500023
Synonyms:
CHEMBL3741601
Type:
Small organic molecule
Emp. Form.:
C24H19N3O7S
Mol. Mass.:
493.489
SMILES:
NS(=O)(=O)c1ccc(CCN2C(=O)c3ccc(cc3C2=O)C(=O)Nc2ccccc2C(O)=O)cc1
: