Target
Gamma-aminobutyric acid receptor subunit alpha-2/beta-2/gamma-2
Ligand
BDBM26267
Substrate
Meas. Tech.
ChEMBL_69647 (CHEMBL681840)
Ki
2.6±n/a nM
Citation
 Liu, RHu, RJZhang, PSkolnick, PCook, JM Synthesis and pharmacological properties of novel 8-substituted imidazobenzodiazepines: high-affinity, selective probes for alpha 5-containing GABAA receptors. J Med Chem 39:1928-34 (1996)  
Target
Name:
Gamma-aminobutyric acid receptor subunit alpha-2/beta-2/gamma-2
Synonyms:
GABA A receptor alpha-2/beta-2/gamma-2 | GABA receptor alpha-2/beta-2/gamma-2 subunit
Type:
Mol. Mass.:
Description:
ASSAY_ID of EBI is 69647
Components:
This complex has 3 components.
Component 1
Name:
Gamma-aminobutyric acid receptor subunit gamma-2
Synonyms:
GABA(A) receptor subunit gamma-2 GBRG2_HUMAN
Type:
PROTEIN
Mol. Mass.:
54172.74
Organism:
Homo sapiens (Human)
Description:
EBI_217
Residue:
467
  
Component 2
Name:
Gamma-aminobutyric acid receptor subunit beta-2
Synonyms:
GABA(A) receptor subunit beta-2 GBRB2_HUMAN
Type:
PROTEIN
Mol. Mass.:
59167.91
Organism:
Homo sapiens (Human)
Description:
EBI_221
Residue:
512
  
Component 3
Name:
Gamma-aminobutyric acid receptor subunit alpha-2
Synonyms:
GABA receptor alpha-2 subunit GBRA2_HUMAN | Gamma-aminobutyric acid receptor subunit alpha-2 (GABRA2)
Type:
Protein
Mol. Mass.:
51338.78
Organism:
Homo sapiens (Human)
Description:
P47869
Residue:
451
  
Component 4
Name:
Gamma-aminobutyric acid receptor subunit beta-2
Synonyms:
GABA(A) receptor subunit beta-2 GBRB2_HUMAN
Type:
PROTEIN
Mol. Mass.:
59167.91
Organism:
Homo sapiens (Human)
Description:
EBI_221
Residue:
512
  
Inhibitor
Name:
BDBM26267
Synonyms:
RO-154513 [3H]Ro15-4513 | ethyl 12-azido-8-methyl-9-oxo-2,4,8-triazatricyclo[8.4.0.0^{2,6}]tetradeca-1(10),3,5,11,13-pentaene-5-carboxylate
Type:
radiolabeled ligand
Emp. Form.:
C15H14N6O3
Mol. Mass.:
326.3101
SMILES:
CCOC(=O)c1ncn-2c1CN(C)C(=O)c1cc(ccc-21)N=[N+]=[N-]
: