Target
Glucokinase regulatory protein
Ligand
BDBM50500213
Substrate
Meas. Tech.
ChEMBL_1545294 (CHEMBL3751187)
Kd
4.5±n/a nM
Citation
 Pennington, LDBartberger, MDCroghan, MDAndrews, KLAshton, KSBourbeau, MPChen, JChmait, SCupples, RFotsch, CHelmering, JHong, FTHungate, RWJordan, SRKong, KLiu, LMichelsen, KMoyer, CNishimura, NNorman, MHReichelt, ASiegmund, ACSivits, GTadesse, STegley, CMVan, GYang, KCYao, GZhang, JLloyd, DJHale, CSt Jean, DJ Discovery and Structure-Guided Optimization of Diarylmethanesulfonamide Disrupters of Glucokinase-Glucokinase Regulatory Protein (GK-GKRP) Binding: Strategic Use of a N ? S (nN ? ?*S-X) Interaction for Conformational Constraint. J Med Chem 58:9663-79 (2015)  
Target
Name:
Glucokinase regulatory protein
Synonyms:
GCKR_MOUSE Glucokinase regulator
Type:
PROTEIN
Mol. Mass.:
64679.62
Organism:
Mus musculus
Description:
ChEMBL_108288
Residue:
587
  
Inhibitor
Name:
BDBM50500213
Synonyms:
CHEMBL3746243
Type:
Small organic molecule
Emp. Form.:
C25H24ClFN4O3S2
Mol. Mass.:
547.064
SMILES:
CC(C)(O)c1ccnc(c1)-c1cccc2cc(sc12)[C@H](NS(=O)(=O)C1CC1)c1c(Cl)cnc(N)c1F
: