Target
Histone deacetylase 1
Ligand
BDBM50500232
Substrate
Meas. Tech.
ChEMBL_1545348 (CHEMBL3751367)
IC50
110±n/a nM
Citation
 Ling, YXu, CLuo, LCao, JFeng, JXue, YZhu, QJu, CLi, FZhang, YZhang, YLing, X Novel ?-Carboline/Hydroxamic Acid Hybrids Targeting Both Histone Deacetylase and DNA Display High Anticancer Activity via Regulation of the p53 Signaling Pathway. J Med Chem 58:9214-27 (2015)  
Target
Name:
Histone deacetylase 1
Synonyms:
Cereblon/Histone deacetylase 1 HDAC1 Histone deacetylase 1 (HDAC1) RPD3L1
Type:
Enzyme
Mol. Mass.:
55090.27
Organism:
Homo sapiens (Human)
Description:
Q13547
Residue:
482
  
Inhibitor
Name:
BDBM50500232
Synonyms:
CHEMBL3746015
Type:
Small organic molecule
Emp. Form.:
C22H21N5O4
Mol. Mass.:
419.4332
SMILES:
COc1ccc(cc1)-c1nc(NC(=O)NCCC(=O)NO)cc2c3ccccc3[nH]c12
: