Target
Histone deacetylase 8
Ligand
BDBM50500235
Substrate
Meas. Tech.
ChEMBL_1545404 (CHEMBL3751629)
IC50
200±n/a nM
Citation
 Ling, YXu, CLuo, LCao, JFeng, JXue, YZhu, QJu, CLi, FZhang, YZhang, YLing, X Novel ?-Carboline/Hydroxamic Acid Hybrids Targeting Both Histone Deacetylase and DNA Display High Anticancer Activity via Regulation of the p53 Signaling Pathway. J Med Chem 58:9214-27 (2015)  
Target
Name:
Histone deacetylase 8
Synonyms:
HD8 HDAC8_HUMAN Histone deacetylase 8 (HDAC-8) | Human HDAC8
Type:
Enzyme
Mol. Mass.:
41749.60
Organism:
Homo sapiens (Human)
Description:
Q9BY41
Residue:
377
  
Inhibitor
Name:
BDBM50500235
Synonyms:
CHEMBL3745758
Type:
Small organic molecule
Emp. Form.:
C24H25N5O4
Mol. Mass.:
447.4864
SMILES:
COc1ccc(cc1)-c1nc(NC(=O)NCCCCC(=O)NO)cc2c3ccccc3[nH]c12
: