Target
Histone deacetylase 6
Ligand
BDBM50500235
Substrate
Meas. Tech.
ChEMBL_1545349 (CHEMBL3751368)
IC50
93±n/a nM
Citation
 Ling, YXu, CLuo, LCao, JFeng, JXue, YZhu, QJu, CLi, FZhang, YZhang, YLing, X Novel ?-Carboline/Hydroxamic Acid Hybrids Targeting Both Histone Deacetylase and DNA Display High Anticancer Activity via Regulation of the p53 Signaling Pathway. J Med Chem 58:9214-27 (2015)  
Target
Name:
Histone deacetylase 6
Synonyms:
Cereblon/Histone deacetylase 6 HDAC6 Histone deacetylase 6 (HDAC6) KIAA0901 | ORF Names:JM21
Type:
Chromatin regulator; hydrolase; repressor
Mol. Mass.:
131381.51
Organism:
Homo sapiens (Human)
Description:
Q9UBN7
Residue:
1215
  
Inhibitor
Name:
BDBM50500235
Synonyms:
CHEMBL3745758
Type:
Small organic molecule
Emp. Form.:
C24H25N5O4
Mol. Mass.:
447.4864
SMILES:
COc1ccc(cc1)-c1nc(NC(=O)NCCCCC(=O)NO)cc2c3ccccc3[nH]c12
: