Target
Histone deacetylase 6
Ligand
BDBM50500224
Substrate
Meas. Tech.
ChEMBL_1545349 (CHEMBL3751368)
IC50
61±n/a nM
Citation
 Ling, YXu, CLuo, LCao, JFeng, JXue, YZhu, QJu, CLi, FZhang, YZhang, YLing, X Novel ?-Carboline/Hydroxamic Acid Hybrids Targeting Both Histone Deacetylase and DNA Display High Anticancer Activity via Regulation of the p53 Signaling Pathway. J Med Chem 58:9214-27 (2015)  
Target
Name:
Histone deacetylase 6
Synonyms:
Cereblon/Histone deacetylase 6 HDAC6 Histone deacetylase 6 (HDAC6) KIAA0901 | ORF Names:JM21
Type:
Chromatin regulator; hydrolase; repressor
Mol. Mass.:
131381.51
Organism:
Homo sapiens (Human)
Description:
Q9UBN7
Residue:
1215
  
Inhibitor
Name:
BDBM50500224
Synonyms:
CHEMBL3745788
Type:
Small organic molecule
Emp. Form.:
C23H22N4O4
Mol. Mass.:
418.4452
SMILES:
COc1ccc(cc1)-c1nc(cc2c3ccccc3[nH]c12)C(=O)NCCCC(=O)NO
: