Target
Bifunctional dihydrofolate reductase-thymidylate synthase
Ligand
BDBM50050419
Substrate
Meas. Tech.
ChEMBL_53465 (CHEMBL665590)
IC50
22±n/a nM
Citation
 Piper, JRJohnson, CAKrauth, CACarter, RLHosmer, CAQueener, SFBorotz, SEPfefferkorn, ER Lipophilic antifolates as agents against opportunistic infections. 1. Agents superior to trimetrexate and piritrexim against Toxoplasma gondii and Pneumocystis carinii in in vitro evaluations. J Med Chem 39:1271-80 (1996)  
Target
Name:
Bifunctional dihydrofolate reductase-thymidylate synthase
Synonyms:
DHFR-TS Dihydrofolate reductase Dihydrofolate reductase; T. gondii vs rat
Type:
Enzyme
Mol. Mass.:
68757.49
Organism:
Toxoplasma gondii
Description:
Q07422
Residue:
610
  
Inhibitor
Name:
BDBM50050419
Synonyms:
6-[(2-Methoxy-5-trifluoromethyl-phenylamino)-methyl]-5-methyl-pyrido[2,3-d]pyrimidine-2,4-diamine | CHEMBL281648
Type:
Small organic molecule
Emp. Form.:
C17H17F3N6O
Mol. Mass.:
378.3517
SMILES:
COc1ccc(cc1NCc1cnc2nc(N)nc(N)c2c1C)C(F)(F)F
: