Target
Dihydrofolate reductase
Ligand
BDBM50034930
Substrate
Meas. Tech.
ChEMBL_55115 (CHEMBL665442)
IC50
13±n/a nM
Citation
 Piper, JRJohnson, CAKrauth, CACarter, RLHosmer, CAQueener, SFBorotz, SEPfefferkorn, ER Lipophilic antifolates as agents against opportunistic infections. 1. Agents superior to trimetrexate and piritrexim against Toxoplasma gondii and Pneumocystis carinii in in vitro evaluations. J Med Chem 39:1271-80 (1996)  
Target
Name:
Dihydrofolate reductase
Synonyms:
DYR_RAT Dihydrofolate reductase (DHFR) Tetrahydrofolate dehydrogenase
Type:
Enzyme
Mol. Mass.:
21638.84
Organism:
Rattus norvegicus (rat)
Description:
Residue:
187
  
Inhibitor
Name:
BDBM50034930
Synonyms:
6-{[(3,5-Dimethoxy-phenyl)-methyl-amino]-methyl}-5-methyl-pyrido[2,3-d]pyrimidine-2,4-diamine | CHEMBL22623
Type:
Small organic molecule
Emp. Form.:
C18H22N6O2
Mol. Mass.:
354.4063
SMILES:
COc1cc(OC)cc(c1)N(C)Cc1cnc2nc(N)nc(N)c2c1C
: