Target
Metabotropic glutamate receptor 1
Ligand
BDBM50407821
Substrate
Meas. Tech.
ChEMBL_105880 (CHEMBL717931)
IC50
>300000±n/a nM
Citation
 Pellicciari, RMarinozzi, MNatalini, BCostantino, GLuneia, RGiorgi, GMoroni, FThomsen, C Synthesis and pharmacological characterization of all sixteen stereoisomers of 2-(2'-carboxy-3'-phenylcyclopropyl)glycine. Focus on (2S,1'S,2'S,3'R)-2-(2'-carboxy-3'-phenylcyclopropyl)glycine, a novel and selective group II metabotropic glutamate receptors antagonist. J Med Chem 39:2259-69 (1996)  
Target
Name:
Metabotropic glutamate receptor 1
Synonyms:
GPRC1A GRM1_HUMAN Metabotropic Glutamate 1a | metabotropic glutamate 1
Type:
Enzyme
Mol. Mass.:
132358.19
Organism:
Homo sapiens (Human)
Description:
Q13255
Residue:
1194
  
Inhibitor
Name:
BDBM50407821
Synonyms:
CHEMBL2115151
Type:
Small organic molecule
Emp. Form.:
C12H13NO4
Mol. Mass.:
235.2359
SMILES:
N[C@H]([C@@H]1[C@H]([C@@H]1c1ccccc1)C(O)=O)C(O)=O
: