Target
C-C chemokine receptor type 4
Ligand
BDBM50380884
Substrate
Meas. Tech.
ChEMBL_1572951 (CHEMBL3801461)
Ki
3.2±n/a nM
Citation
 Shukla, LAjram, LABegg, MEvans, BGraves, RHHodgson, STLynn, SMMiah, AHPercy, JMProcopiou, PARichards, SASlack, RJ 2,8-Diazaspiro[4.5]decan-8-yl)pyrimidin-4-amine potent CCR4 antagonists capable of inducing receptor endocytosis. Eur J Med Chem 115:14-25 (2016)  
Target
Name:
C-C chemokine receptor type 4
Synonyms:
C-C CKR-4 C-C chemokine receptor type 4 (CCR4) CCR-4 CCR4_HUMAN CMKBR4 | K5-5
Type:
Enzyme
Mol. Mass.:
41406.41
Organism:
Homo sapiens (Human)
Description:
P51679
Residue:
360
  
Inhibitor
Name:
BDBM50380884
Synonyms:
CHEMBL2018954
Type:
Small organic molecule
Emp. Form.:
C23H27BrN4O5S
Mol. Mass.:
551.453
SMILES:
COc1ccc(COc2nc(Br)cnc2NS(=O)(=O)c2ccc(C)cc2)cc1OCCN(C)C
: