Target
C-C chemokine receptor type 4
Ligand
BDBM50500912
Substrate
Meas. Tech.
ChEMBL_1572951 (CHEMBL3801461)
Ki
126±n/a nM
Citation
 Shukla, LAjram, LABegg, MEvans, BGraves, RHHodgson, STLynn, SMMiah, AHPercy, JMProcopiou, PARichards, SASlack, RJ 2,8-Diazaspiro[4.5]decan-8-yl)pyrimidin-4-amine potent CCR4 antagonists capable of inducing receptor endocytosis. Eur J Med Chem 115:14-25 (2016)  
Target
Name:
C-C chemokine receptor type 4
Synonyms:
C-C CKR-4 C-C chemokine receptor type 4 (CCR4) CCR-4 CCR4_HUMAN CMKBR4 | K5-5
Type:
Enzyme
Mol. Mass.:
41406.41
Organism:
Homo sapiens (Human)
Description:
P51679
Residue:
360
  
Inhibitor
Name:
BDBM50500912
Synonyms:
CHEMBL3797946
Type:
Small organic molecule
Emp. Form.:
C26H30Cl2F6N6O5
Mol. Mass.:
691.45
SMILES:
OC(=O)C(F)(F)F.OC(=O)C(F)(F)F.CNCC(=O)N1CCC2(C1)CCN(CC2)c1nccc(NCc2ccc(Cl)cc2Cl)n1
: