Target
Metabotropic glutamate receptor 1
Ligand
BDBM50258140
Substrate
Meas. Tech.
ChEMBL_1573383 (CHEMBL3804545)
EC50
275±n/a nM
Citation
 Garcia-Barrantes, PMCho, HPStarr, TMBlobaum, ALNiswender, CMConn, PJLindsley, CW Re-exploration of the mGlu? PAM Ro 07-11401 scaffold: Discovery of analogs with improved CNS penetration despite steep SAR. Bioorg Med Chem Lett 26:2289-92 (2016)  
Target
Name:
Metabotropic glutamate receptor 1
Synonyms:
GRM1_RAT Grm1 Metabotropic glutamate receptor Mglur1 metabotropic glutamate 1/5-D metabotropic glutamate receptor 1 isoform alpha precursor
Type:
Enzyme Catalytic Domain
Mol. Mass.:
133240.47
Organism:
RAT
Description:
metabotropic glutamate 1/2 0 RAT::P23385
Residue:
1199
  
Inhibitor
Name:
BDBM50258140
Synonyms:
CHEMBL521982 | N-(4-(trifluoromethyl)oxazol-2-yl)-9H-xanthene-9-carboxamide
Type:
Small organic molecule
Emp. Form.:
C18H11F3N2O3
Mol. Mass.:
360.2867
SMILES:
FC(F)(F)c1coc(NC(=O)C2c3ccccc3Oc3ccccc23)n1
: