Target
Metabotropic glutamate receptor 1
Ligand
BDBM50500949
Substrate
Meas. Tech.
ChEMBL_1573383 (CHEMBL3804545)
EC50
1800±n/a nM
Citation
 Garcia-Barrantes, PMCho, HPStarr, TMBlobaum, ALNiswender, CMConn, PJLindsley, CW Re-exploration of the mGlu? PAM Ro 07-11401 scaffold: Discovery of analogs with improved CNS penetration despite steep SAR. Bioorg Med Chem Lett 26:2289-92 (2016)  
Target
Name:
Metabotropic glutamate receptor 1
Synonyms:
GRM1_RAT Grm1 Metabotropic glutamate receptor Mglur1 metabotropic glutamate 1/5-D metabotropic glutamate receptor 1 isoform alpha precursor
Type:
Enzyme Catalytic Domain
Mol. Mass.:
133240.47
Organism:
RAT
Description:
metabotropic glutamate 1/2 0 RAT::P23385
Residue:
1199
  
Inhibitor
Name:
BDBM50500949
Synonyms:
CHEMBL3797793
Type:
Small organic molecule
Emp. Form.:
C18H11N3O2S
Mol. Mass.:
333.364
SMILES:
O=C(Nc1nc(cs1)C#N)C1c2ccccc2Oc2ccccc12
: