Target
Adenosine receptor A3
Ligand
BDBM50051351
Substrate
Meas. Tech.
ChEMBL_31838 (CHEMBL641515)
Ki
24000±n/a nM
Citation
 Karton, YJiang, JLJi, XDMelman, NOlah, MEStiles, GLJacobson, KA Synthesis and biological activities of flavonoid derivatives as A3 adenosine receptor antagonists. J Med Chem 39:2293-301 (1996)  
Target
Name:
Adenosine receptor A3
Synonyms:
A3 adenosine receptor (hA3) ADORA3 | Adenosine A3 receptor (A3AR)
Type:
G Protein-Coupled Receptor (GPCR)
Mol. Mass.:
36197.32
Organism:
Homo sapiens (Human)
Description:
P0DMS8
Residue:
318
  
Inhibitor
Name:
BDBM50051351
Synonyms:
3-Hydroxy-6-methoxy-2-phenylethynyl-chromen-4-one | CHEMBL74328
Type:
Small organic molecule
Emp. Form.:
C18H12O4
Mol. Mass.:
292.2855
SMILES:
COc1ccc2oc(C#Cc3ccccc3)c(O)c(=O)c2c1
: