Target
Adenosine receptor A1
Ligand
BDBM50051357
Substrate
Meas. Tech.
ChEMBL_29152 (CHEMBL639432)
Ki
32300±n/a nM
Citation
 Karton, YJiang, JLJi, XDMelman, NOlah, MEStiles, GLJacobson, KA Synthesis and biological activities of flavonoid derivatives as A3 adenosine receptor antagonists. J Med Chem 39:2293-301 (1996)  
Target
Name:
Adenosine receptor A1
Synonyms:
AA1R_RAT ADENOSINE A1 high Adenosine A1 receptor (A1) Adenosine receptors A1 | Adora1
Type:
Protein
Mol. Mass.:
36704.13
Organism:
Rattus norvegicus (rat)
Description:
Residue:
326
  
Inhibitor
Name:
BDBM50051357
Synonyms:
2-(2,4-Diethoxy-phenyl)-3,5,7-triethoxy-chromen-4-one | CHEMBL74505
Type:
Small organic molecule
Emp. Form.:
C25H30O7
Mol. Mass.:
442.5015
SMILES:
CCOc1ccc(c(OCC)c1)-c1oc2cc(OCC)cc(OCC)c2c(=O)c1OCC
: