Target
Adenosine receptor A3
Ligand
BDBM50051357
Substrate
Meas. Tech.
ChEMBL_31838 (CHEMBL641515)
Ki
7270.0±n/a nM
Citation
 Karton, YJiang, JLJi, XDMelman, NOlah, MEStiles, GLJacobson, KA Synthesis and biological activities of flavonoid derivatives as A3 adenosine receptor antagonists. J Med Chem 39:2293-301 (1996)  
Target
Name:
Adenosine receptor A3
Synonyms:
A3 adenosine receptor (hA3) ADORA3 | Adenosine A3 receptor (A3AR)
Type:
G Protein-Coupled Receptor (GPCR)
Mol. Mass.:
36197.32
Organism:
Homo sapiens (Human)
Description:
P0DMS8
Residue:
318
  
Inhibitor
Name:
BDBM50051357
Synonyms:
2-(2,4-Diethoxy-phenyl)-3,5,7-triethoxy-chromen-4-one | CHEMBL74505
Type:
Small organic molecule
Emp. Form.:
C25H30O7
Mol. Mass.:
442.5015
SMILES:
CCOc1ccc(c(OCC)c1)-c1oc2cc(OCC)cc(OCC)c2c(=O)c1OCC
: