Target
Prolyl endopeptidase
Ligand
BDBM50051521
Substrate
Meas. Tech.
ChEMBL_158375 (CHEMBL769576)
IC50
>100000±n/a nM
Citation
 Portevin, BBenoist, ARémond, GHervé, YVincent, MLepagnol, JDe Nanteuil, G New prolyl endopeptidase inhibitors: in vitro and in vivo activities of azabicyclo[2.2.2]octane, azabicyclo[2.2.1]heptane, and perhydroindole derivatives. J Med Chem 39:2379-91 (1996)  
Target
Name:
Prolyl endopeptidase
Synonyms:
PE POP PREP Prolyl oligopeptidase
Type:
Enzyme
Mol. Mass.:
80688.50
Organism:
Homo sapiens (Human)
Description:
P48147
Residue:
710
  
Inhibitor
Name:
BDBM50051521
Synonyms:
1-[3-(Imidazole-1-carbonyl)-2-aza-bicyclo[2.2.2]oct-2-yl]-4-phenyl-butan-1-one | CHEMBL309781
Type:
Small organic molecule
Emp. Form.:
C21H25N3O2
Mol. Mass.:
351.4421
SMILES:
O=C(CCCc1ccccc1)N1C2CCC(CC2)C1C(=O)n1ccnc1
: