Target
Prolyl endopeptidase
Ligand
BDBM50051547
Substrate
Meas. Tech.
ChEMBL_158375 (CHEMBL769576)
IC50
32±n/a nM
Citation
 Portevin, BBenoist, ARémond, GHervé, YVincent, MLepagnol, JDe Nanteuil, G New prolyl endopeptidase inhibitors: in vitro and in vivo activities of azabicyclo[2.2.2]octane, azabicyclo[2.2.1]heptane, and perhydroindole derivatives. J Med Chem 39:2379-91 (1996)  
Target
Name:
Prolyl endopeptidase
Synonyms:
PE POP PREP Prolyl oligopeptidase
Type:
Enzyme
Mol. Mass.:
80688.50
Organism:
Homo sapiens (Human)
Description:
P48147
Residue:
710
  
Inhibitor
Name:
BDBM50051547
Synonyms:
(S)-2-(Pyrrolidine-1-carbonyl)-pyrrolidine-1-carboxylic acid tert-butyl ester CHEMBL311364
Type:
Small organic molecule
Emp. Form.:
C14H24N2O3
Mol. Mass.:
268.352
SMILES:
CC(C)(C)OC(=O)N1CCC[C@H]1C(=O)N1CCCC1
: