Target
Reverse transcriptase/RNaseH
Ligand
BDBM50052063
Substrate
Meas. Tech.
ChEMBL_195066 (CHEMBL797521)
IC50
500000±n/a nM
Citation
 Campiani, GNacci, VFiorini, IDe Filippis, MPGarofalo, AGreco, GNovellino, EAltamura, SDi Renzo, L Pyrrolobenzothiazepinones and pyrrolobenzoxazepinones: novel and specific non-nucleoside HIV-1 reverse transcriptase inhibitors with antiviral activity. J Med Chem 39:2672-80 (1996)  
Target
Name:
Reverse transcriptase/RNaseH
Synonyms:
HIV-1 Reverse Transcriptase RNase H Reverse transcriptase/RNaseH
Type:
PROTEIN
Mol. Mass.:
65229.15
Organism:
Human immunodeficiency virus 1
Description:
ChEMBL_1473730
Residue:
566
  
Inhibitor
Name:
BDBM50052063
Synonyms:
5-Ethyl-6-oxo-5-phenyl-5,6-dihydro-6lambda*4*-thia-10b-aza-benzo[e]azulen-4-one | CHEMBL92330
Type:
Small organic molecule
Emp. Form.:
C20H17NO2S
Mol. Mass.:
335.419
SMILES:
CCC1(c2ccccc2)C(=O)c2cccn2-c2ccccc2S1=O
: