Target
Genome polyprotein
Ligand
BDBM50501751
Substrate
Meas. Tech.
ChEMBL_1678294 (CHEMBL4028437)
Ki
272000±n/a nM
Citation
 Schulz, RAtef, ABecker, DGottschalk, FTauber, CWagner, SArkona, CAbdel-Hafez, AAFarag, HHRademann, JWolber, G Phenylthiomethyl Ketone-Based Fragments Show Selective and Irreversible Inhibition of Enteroviral 3C Proteases. J Med Chem 61:1218-1230 (2018)  
Target
Name:
Genome polyprotein
Synonyms:
3C-like proteinase (CVB3 3Cpro) P1A P1C P2A P2C P3B P3D-POL Picornain 3C Protease 2A Protein 2A Protein 2C Protein 3B Protein VP1 Protein VP3 RNA-directed RNA polymerase 3D-POL VPg Virion protein 2 Virion protein 4
Type:
Enzyme
Mol. Mass.:
243464.96
Organism:
Coxsackievirus B3 (strain Nancy)
Description:
P03313
Residue:
2185
  
Inhibitor
Name:
BDBM50501751
Synonyms:
CHEMBL4096233
Type:
Small organic molecule
Emp. Form.:
C28H24N2O2S2
Mol. Mass.:
484.632
SMILES:
NC(=O)c1cc(cn1C\C=C\c1ccccc1)C(=O)C(Sc1ccccc1)Sc1ccccc1
: