Target
Neurotensin receptor type 1
Ligand
BDBM50502382
Substrate
Meas. Tech.
ChEMBL_1807457 (CHEMBL4306816)
Ki
0.880000±n/a nM
Citation
 Schindler, LBernhardt, GKeller, M Modifications at Arg and Ile Give Neurotensin(8-13) Derivatives with High Stability and Retained NTS ACS Med Chem Lett 10:960-965 (2019)  
Target
Name:
Neurotensin receptor type 1
Synonyms:
Dopamine receptor D2L/neurotensin receptor NTS1 NTRR Neurotensin receptor 1 | neurotensin receptor type 1
Type:
PROTEIN
Mol. Mass.:
46278.89
Organism:
Homo sapiens (Human)
Description:
ChEMBL_1453811
Residue:
418
  
Inhibitor
Name:
BDBM50502382
Synonyms:
CHEMBL4567709
Type:
Small organic molecule
Emp. Form.:
C45H69F9N12O14
Mol. Mass.:
1173.087
SMILES:
OC(=O)C(F)(F)F.OC(=O)C(F)(F)F.OC(=O)C(F)(F)F.CN[C@@H](CCCNC(N)=N)C(=O)N[C@@H](CCCNC(N)=N)C(=O)N1CCC[C@H]1C(=O)N[C@@H](Cc1ccc(O)cc1)C(=O)N[C@H](C(=O)N[C@@H](CC(C)C)C(O)=O)C(C)(C)C
: