Target
D(2) dopamine receptor
Ligand
BDBM50002173
Substrate
Meas. Tech.
ChEMBL_59897 (CHEMBL673023)
EC50
0.37±n/a nM
Citation
 Glase, SAAkunne, HCHeffner, TGJaen, JCMacKenzie, RGMeltzer, LTPugsley, TASmith, SJWise, LD Aryl 1-but-3-ynyl-4-phenyl-1,2,3,6-tetrahydropyridines as potential antipsychotic agents: synthesis and structure-activity relationships. J Med Chem 39:3179-87 (1996)  
Target
Name:
D(2) dopamine receptor
Synonyms:
D(2) dopamine receptor DOPAMINE D2 Long DRD2 Dopamine D2 receptor Dopamine D2 receptor (D2R) Dopamine2-like | d2
Type:
Cell-surface receptors
Mol. Mass.:
50647.10
Organism:
Homo sapiens (Human)
Description:
P14416
Residue:
443
  
Inhibitor
Name:
BDBM50002173
Synonyms:
3-(4-(3,6-dihydro-4-phenyl-1(2H)-pyridinyl)butyl)-1H-indol-5-ol 3-[4-(4-phenyl-3,6-dihydropyridin-1(2H)-yl)butyl]-1H-indol-5-ol roxindole
Type:
Small organic molecule
Emp. Form.:
C23H26N2O
Mol. Mass.:
346.4653
SMILES:
Oc1ccc2[nH]cc(CCCCN3CCC(=CC3)c3ccccc3)c2c1
: