Target
Transient receptor potential cation channel subfamily V member 6
Ligand
BDBM50502757
Substrate
Meas. Tech.
ChEMBL_1808810 (CHEMBL4308169)
IC50
600±n/a nM
Citation
 Cunha, MRBhardwaj, RLindinger, SButorac, CRomanin, CHediger, MAReymond, JL Photoswitchable Inhibitor of the Calcium Channel TRPV6. ACS Med Chem Lett 10:1341-1345 (2019)  
Target
Name:
Transient receptor potential cation channel subfamily V member 6
Synonyms:
CaT-L CaT1 ECAC2 TRPV6 | TRPV6_HUMAN
Type:
PROTEIN
Mol. Mass.:
87295.84
Organism:
Homo sapiens (Human)
Description:
ChEMBL_103784
Residue:
765
  
Inhibitor
Name:
BDBM50502757
Synonyms:
CHEMBL4470714
Type:
Small organic molecule
Emp. Form.:
C28H33N5
Mol. Mass.:
439.5951
SMILES:
C(N1CCN(CC1)[C@H]1CC[C@H](CC1)c1ccccc1)c1ccc(\N=N/c2ccccc2)nc1
: