Target
Transient receptor potential cation channel subfamily V member 6
Ligand
BDBM50502758
Substrate
Meas. Tech.
ChEMBL_1808807 (CHEMBL4308166)
IC50
>10000±n/a nM
Citation
 Cunha, MRBhardwaj, RLindinger, SButorac, CRomanin, CHediger, MAReymond, JL Photoswitchable Inhibitor of the Calcium Channel TRPV6. ACS Med Chem Lett 10:1341-1345 (2019)  
Target
Name:
Transient receptor potential cation channel subfamily V member 6
Synonyms:
CaT-L CaT1 ECAC2 TRPV6 | TRPV6_HUMAN
Type:
PROTEIN
Mol. Mass.:
87295.84
Organism:
Homo sapiens (Human)
Description:
ChEMBL_103784
Residue:
765
  
Inhibitor
Name:
BDBM50502758
Synonyms:
CHEMBL4580679
Type:
Small organic molecule
Emp. Form.:
C29H34N4
Mol. Mass.:
438.6071
SMILES:
C(N1CCN(CC1)[C@H]1CC[C@H](CC1)c1ccccc1)c1ccc(cc1)\N=N\c1ccccc1
: