Target
Transient receptor potential cation channel subfamily V member 6
Ligand
BDBM50502759
Substrate
Meas. Tech.
ChEMBL_1808816 (CHEMBL4308175)
IC50
320±n/a nM
Citation
 Cunha, MRBhardwaj, RLindinger, SButorac, CRomanin, CHediger, MAReymond, JL Photoswitchable Inhibitor of the Calcium Channel TRPV6. ACS Med Chem Lett 10:1341-1345 (2019)  
Target
Name:
Transient receptor potential cation channel subfamily V member 6
Synonyms:
CaT-L CaT1 ECAC2 TRPV6 | TRPV6_HUMAN
Type:
PROTEIN
Mol. Mass.:
87295.84
Organism:
Homo sapiens (Human)
Description:
ChEMBL_103784
Residue:
765
  
Inhibitor
Name:
BDBM50502759
Synonyms:
CHEMBL4435596
Type:
Small organic molecule
Emp. Form.:
C22H29N3
Mol. Mass.:
335.4858
SMILES:
Cc1cccc(c1)[C@@H]1CC[C@@H](CC1)N1CCN(CC1)c1cccnc1
: