Target
Cruzipain
Ligand
BDBM50502846
Substrate
Meas. Tech.
ChEMBL_1808996 (CHEMBL4308355)
Ki
1.6±n/a nM
Citation
 Gomes, JCCianni, LRibeiro, JDos Reis Rocho, Fda Costa Martins Silva, SBatista, PHJMoraes, CBFranco, CHFreitas-Junior, LHGKenny, PWLeitão, ABurtoloso, ACBde Vita, DMontanari, CA Synthesis and structure-activity relationship of nitrile-based cruzain inhibitors incorporating a trifluoroethylamine-based P2 amide replacement. Bioorg Med Chem 27:0 (2019)  
Target
Name:
Cruzipain
Synonyms:
CYSP_TRYCR Cruzaine | Major cysteine proteinase
Type:
Protein
Mol. Mass.:
49831.41
Organism:
Trypanosoma cruzi
Description:
P25779
Residue:
467
  
Inhibitor
Name:
BDBM50502846
Synonyms:
CHEMBL4451757
Type:
Small organic molecule
Emp. Form.:
C23H26F3N3O
Mol. Mass.:
417.4672
SMILES:
CC(C)C[C@H](N[C@@H](c1ccccc1)C(F)(F)F)C(=O)N[C@@H](Cc1ccccc1)C#N
: