Target
Vasopressin V2 receptor
Ligand
BDBM50052917
Substrate
Meas. Tech.
ChEMBL_215007 (CHEMBL818806)
IC50
>100000±n/a nM
Citation
 Ogawa, HYamashita, HKondo, KYamamura, YMiyamoto, HKan, KKitano, KTanaka, MNakaya, KNakamura, SMori, TTominaga, MYabuuchi, Y Orally active, nonpeptide vasopressin V2 receptor antagonists: a novel series of 1-[4-(benzoylamino)benzoyl]-2,3,4,5-tetrahydro-1H-benzazepines and related compounds. J Med Chem 39:3547-55 (1996)  
Target
Name:
Vasopressin V2 receptor
Synonyms:
AVPR V2 Avpr2 V2R_RAT Vasopressin receptor
Type:
G-protein coupled receptor
Mol. Mass.:
40761.85
Organism:
Rattus norvegicus (Rat)
Description:
Residue:
371
  
Inhibitor
Name:
BDBM50052917
Synonyms:
CHEMBL331956 | N-[4-(3,4-Dihydro-2H-quinoline-1-carbonyl)-phenyl]-acetamide
Type:
Small organic molecule
Emp. Form.:
C18H18N2O2
Mol. Mass.:
294.3477
SMILES:
CC(=O)Nc1ccc(cc1)C(=O)N1CCCc2ccccc12
: