Target
Vasopressin V2 receptor
Ligand
BDBM50052923
Substrate
Meas. Tech.
ChEMBL_215007 (CHEMBL818806)
IC50
4100±n/a nM
Citation
 Ogawa, HYamashita, HKondo, KYamamura, YMiyamoto, HKan, KKitano, KTanaka, MNakaya, KNakamura, SMori, TTominaga, MYabuuchi, Y Orally active, nonpeptide vasopressin V2 receptor antagonists: a novel series of 1-[4-(benzoylamino)benzoyl]-2,3,4,5-tetrahydro-1H-benzazepines and related compounds. J Med Chem 39:3547-55 (1996)  
Target
Name:
Vasopressin V2 receptor
Synonyms:
AVPR V2 Avpr2 V2R_RAT Vasopressin receptor
Type:
G-protein coupled receptor
Mol. Mass.:
40761.85
Organism:
Rattus norvegicus (Rat)
Description:
Residue:
371
  
Inhibitor
Name:
BDBM50052923
Synonyms:
CHEMBL116820 | N-[4-(2,3-Dihydro-benzo[1,4]oxazine-4-carbonyl)-phenyl]-2-methyl-benzamide
Type:
Small organic molecule
Emp. Form.:
C23H20N2O3
Mol. Mass.:
372.4165
SMILES:
Cc1ccccc1C(=O)Nc1ccc(cc1)C(=O)N1CCOc2ccccc12
: