Target
Vasopressin V1a receptor
Ligand
BDBM50052917
Substrate
Meas. Tech.
ChEMBL_214553 (CHEMBL820170)
IC50
74000±n/a nM
Citation
 Ogawa, HYamashita, HKondo, KYamamura, YMiyamoto, HKan, KKitano, KTanaka, MNakaya, KNakamura, SMori, TTominaga, MYabuuchi, Y Orally active, nonpeptide vasopressin V2 receptor antagonists: a novel series of 1-[4-(benzoylamino)benzoyl]-2,3,4,5-tetrahydro-1H-benzazepines and related compounds. J Med Chem 39:3547-55 (1996)  
Target
Name:
Vasopressin V1a receptor
Synonyms:
Avpr1a VASOPRESSIN V1A Vasopressin V1a receptor | Vasopressin receptor
Type:
Enzyme Catalytic Domain
Mol. Mass.:
47674.81
Organism:
RAT
Description:
VASOPRESSIN V1A AVPR1A RAT::P30560
Residue:
424
  
Inhibitor
Name:
BDBM50052917
Synonyms:
CHEMBL331956 | N-[4-(3,4-Dihydro-2H-quinoline-1-carbonyl)-phenyl]-acetamide
Type:
Small organic molecule
Emp. Form.:
C18H18N2O2
Mol. Mass.:
294.3477
SMILES:
CC(=O)Nc1ccc(cc1)C(=O)N1CCCc2ccccc12
: