Target
Vasopressin V1a receptor
Ligand
BDBM50052923
Substrate
Meas. Tech.
ChEMBL_214553 (CHEMBL820170)
IC50
7700±n/a nM
Citation
 Ogawa, HYamashita, HKondo, KYamamura, YMiyamoto, HKan, KKitano, KTanaka, MNakaya, KNakamura, SMori, TTominaga, MYabuuchi, Y Orally active, nonpeptide vasopressin V2 receptor antagonists: a novel series of 1-[4-(benzoylamino)benzoyl]-2,3,4,5-tetrahydro-1H-benzazepines and related compounds. J Med Chem 39:3547-55 (1996)  
Target
Name:
Vasopressin V1a receptor
Synonyms:
Avpr1a VASOPRESSIN V1A Vasopressin V1a receptor | Vasopressin receptor
Type:
Enzyme Catalytic Domain
Mol. Mass.:
47674.81
Organism:
RAT
Description:
VASOPRESSIN V1A AVPR1A RAT::P30560
Residue:
424
  
Inhibitor
Name:
BDBM50052923
Synonyms:
CHEMBL116820 | N-[4-(2,3-Dihydro-benzo[1,4]oxazine-4-carbonyl)-phenyl]-2-methyl-benzamide
Type:
Small organic molecule
Emp. Form.:
C23H20N2O3
Mol. Mass.:
372.4165
SMILES:
Cc1ccccc1C(=O)Nc1ccc(cc1)C(=O)N1CCOc2ccccc12
: