Target
Cellular retinoic acid-binding protein 2
Ligand
BDBM50053094
Substrate
Meas. Tech.
ChEMBL_52401 (CHEMBL875705)
Kd
13±n/a nM
Citation
 Muccio, DDBrouillette, WJAlam, MVaezi, MFSani, BPVenepally, PReddy, LLi, ENorris, AWSimpson-Herren, LHill, DL Conformationally defined 6-s-trans-retinoic acid analogs. 3. Structure-activity relationships for nuclear receptor binding, transcriptional activity, and cancer chemopreventive activity. J Med Chem 39:3625-35 (1996)  
Target
Name:
Cellular retinoic acid-binding protein 2
Synonyms:
Cellular retinoic acid-binding protein II RABP2_MOUSE
Type:
PROTEIN
Mol. Mass.:
15744.92
Organism:
Mus musculus
Description:
ChEMBL_52402
Residue:
138
  
Inhibitor
Name:
BDBM50053094
Synonyms:
(2E,4E,6E)-8-[2,3-Dimethyl-cyclohex-2-en-(E)-ylidene]-3,7-dimethyl-octa-2,4,6-trienoic acid | CHEMBL122823
Type:
Small organic molecule
Emp. Form.:
C18H24O2
Mol. Mass.:
272.382
SMILES:
C\C(\C=C\C=C(/C)\C=C1/CCCC(C)=C1C)=C/C(O)=O
: