Target
Cellular retinoic acid-binding protein 2
Ligand
BDBM50407270
Substrate
Meas. Tech.
ChEMBL_52400 (CHEMBL665904)
Kd
>200±n/a nM
Citation
 Muccio, DDBrouillette, WJAlam, MVaezi, MFSani, BPVenepally, PReddy, LLi, ENorris, AWSimpson-Herren, LHill, DL Conformationally defined 6-s-trans-retinoic acid analogs. 3. Structure-activity relationships for nuclear receptor binding, transcriptional activity, and cancer chemopreventive activity. J Med Chem 39:3625-35 (1996)  
Target
Name:
Cellular retinoic acid-binding protein 2
Synonyms:
Cellular retinoic acid-binding protein II RABP2_MOUSE
Type:
PROTEIN
Mol. Mass.:
15744.92
Organism:
Mus musculus
Description:
ChEMBL_52402
Residue:
138
  
Inhibitor
Name:
BDBM50407270
Synonyms:
CHEMBL2111790
Type:
Small organic molecule
Emp. Form.:
C20H28O2
Mol. Mass.:
300.4351
SMILES:
CC(C)C1=C(C)CCC\C1=C/C(/C)=C\C=C\C(\C)=C\C(O)=O
: