Target
Serine/threonine-protein kinase ATR
Ligand
BDBM50341209
Substrate
Meas. Tech.
ChEMBL_1809510 (CHEMBL4308970)
EC50
35±n/a nM
Citation
 He, SLi, QJiang, XLu, XFeng, FQu, WChen, YSun, H Design of Small Molecule Autophagy Modulators: A Promising Druggable Strategy. J Med Chem 61:4656-4687 (2018)  
Target
Name:
Serine/threonine-protein kinase ATR
Synonyms:
ATR Ataxia telangiectasia and Rad3-related protein (ATR) FRP1 | Serine-protein kinase ATR
Type:
Protein
Mol. Mass.:
301404.58
Organism:
Homo sapiens (Human)
Description:
Q13535
Residue:
2644
  
Inhibitor
Name:
BDBM50341209
Synonyms:
9-(6-aminopyridin-3-yl)-1-(3-(trifluoromethyl)phenyl)benzo[h][1,6]naphthyridin-2(1H)-one | CHEMBL1765602
Type:
Small organic molecule
Emp. Form.:
C24H15F3N4O
Mol. Mass.:
432.3973
SMILES:
Nc1ccc(cn1)-c1ccc2ncc3ccc(=O)n(-c4cccc(c4)C(F)(F)F)c3c2c1
: