Target
Cyclin-dependent kinase 2/G1/S-specific cyclin-E1
Ligand
BDBM31545
Substrate
Meas. Tech.
ChEMBL_1810510 (CHEMBL4309970)
IC50
590±n/a nM
Citation
 Jorda, RHendrychová, DVoller, J?ezní?ková, EGucký, TKry?tof, V How Selective Are Pharmacological Inhibitors of Cell-Cycle-Regulating Cyclin-Dependent Kinases? J Med Chem 61:9105-9120 (2018)  
Target
Name:
Cyclin-dependent kinase 2/G1/S-specific cyclin-E1
Synonyms:
CDK2/CycE CDK2/E Cyclin-Dependent Kinase 2 (CDK2) Cyclin-dependent kinase 2/cyclin E1
Type:
Protein
Mol. Mass.:
Description:
Components:
This complex has 2 components.
Component 1
Name:
Cyclin-dependent kinase 2
Synonyms:
CDK2 CDK2_HUMAN Cell division protein kinase 2 Protein cereblon/Cyclin-dependent kinase 2 | p33 protein kinase
Type:
Enzyme Subunit
Mol. Mass.:
33938.17
Organism:
Homo sapiens (Human)
Description:
P24941
Residue:
298
  
Component 2
Name:
G1/S-specific cyclin-E1
Synonyms:
CCNE CCNE1_HUMAN
Type:
Enzyme Subunit
Mol. Mass.:
47073.17
Organism:
Homo sapiens (Human)
Description:
Residue:
410
  
Inhibitor
Name:
BDBM31545
Synonyms:
Milciclib | pyrazolo[4,3-h]quinazoline-3-carboxamide, 28
Type:
Small organic molecule
Emp. Form.:
C25H32N8O
Mol. Mass.:
460.5746
SMILES:
CNC(=O)c1nn(C)c-2c1C(C)(C)Cc1cnc(Nc3ccc(cc3)N3CCN(C)CC3)nc-21
: